WIP: clan-cli: line-buffer prefixed subprocess output
PR Size Review Check / pr-size-review-gate (pull_request) Successful in 6s
label-pr / external (pull_request_target) Successful in 5s
sizelint on each commit / sizelint (pull_request) Successful in 10s
buildbot/nix-eval evaluation succeeded in 3m 15s (1 warning)
buildbot/nix-build 150 attributes built
cli: support boot, test and dry-activate when updating machines
PR Size Review Check / pr-size-review-gate (pull_request) Successful in 5s
sizelint on each commit / sizelint (pull_request) Successful in 9s
label-pr / external (pull_request_target) Successful in 6s
buildbot/nix-eval evaluation succeeded in 3m 59s (1 warning)
buildbot/nix-build 150 attributes built
Type
Community Contribution
1
vars/age: implement restartUnits
PR Size Review Check / pr-size-review-gate (pull_request) Successful in 5s
label-pr / external (pull_request_target) Successful in 5s
sizelint on each commit / sizelint (pull_request) Successful in 10s
buildbot/nix-eval evaluation failed
buildbot/nix-build build failed
clan-cli/init: allow skipping admin keys
PR Size Review Check / pr-size-review-gate (pull_request) Successful in 6s
label-pr / external (pull_request_target) Successful in 6s
sizelint on each commit / sizelint (pull_request) Successful in 10s
buildbot/nix-eval evaluation succeeded in 4m 47s (50 warnings)
buildbot/nix-build gitea:clan/clan-core#checks.aarch64-darwin.eval-tests failed
buildbot/nix-build gitea:clan/clan-core#checks.aarch64-darwin.clan-pytest-without-core failed
buildbot/nix-build gitea:clan/clan-core#checks.aarch64-darwin.devShell-clan-site failed
buildbot/nix-build gitea:clan/clan-core#checks.aarch64-linux.devshell failed
buildbot/nix-build gitea:clan/clan-core#checks.aarch64-darwin.all-packages failed
buildbot/nix-build gitea:clan/clan-core#checks.aarch64-linux.all-packages failed
buildbot/nix-build gitea:clan/clan-core#checks.aarch64-linux.clan-test-iso failed
buildbot/nix-build gitea:clan/clan-core#checks.aarch64-linux.clan-pytest-with-core failed
buildbot/nix-build gitea:clan/clan-core#checks.aarch64-darwin.devshell failed
buildbot/nix-build gitea:clan/clan-core#checks.aarch64-darwin.clan-pytest-with-core failed
buildbot/nix-build gitea:clan/clan-core#checks.aarch64-darwin.treefmt failed
buildbot/nix-build gitea:clan/clan-core#checks.aarch64-linux.borgbackup error: build of '/nix/store/yzllyxpx7yx5charhhknhx1h80dgzrks-merged-test-dir-borgbackup.drv^out' failed: error: gave up after 9 reschedules
buildbot/nix-build gitea:clan/clan-core#checks.aarch64-linux.dm-dns error: build of '/nix/store/d5almx1kbj048lc954ydsais4g48mjcj-merged-test-dir-dm-dns.drv^out' failed: error: gave up after 9 reschedules
buildbot/nix-build gitea:clan/clan-core#checks.aarch64-linux.data-mesher error: build of '/nix/store/vix2rxv6qbhxbzhdcraiaik9j9fk50bj-merged-test-dir-data-mesher.drv^out' failed: error: gave up after 9 reschedules
buildbot/nix-build gitea:clan/clan-core#checks.aarch64-linux.hello-service error: build of '/nix/store/w57zn5d5mvjpj5m3vx6ha3l25anzmm6j-merged-test-dir-hello-service.drv^out' failed: error: error: gRPC AddMultipleToStore on 'nix-store.geninf.io:50051' failed: error: path '/n
buildbot/nix-build gitea:clan/clan-core#checks.aarch64-linux.kde error: build of '/nix/store/7ss8jk5j8lvlkvz9z21kmdvs01hrphhs-merged-test-dir-kde.drv^out' failed: error: error: gRPC AddMultipleToStore on 'nix-store.geninf.io:50051' failed: error: path '/nix/store/c
buildbot/nix-build gitea:clan/clan-core#checks.aarch64-linux.admin error: build of '/nix/store/nzljmbmyjqam1ricrqlv38l0a7w6vr4z-merged-test-dir-admin.drv^out' failed: error: error: gRPC AddMultipleToStore on 'nix-store.geninf.io:50051' failed: error: path '/nix/store
buildbot/nix-build gitea:clan/clan-core#checks.aarch64-linux.matrix-synapse error: build of '/nix/store/86asji4bmwf0nk34wr94a16h090d08mi-merged-test-dir-matrix-synapse.drv^out' failed: error: error: gRPC AddMultipleToStore on 'nix-store.geninf.io:50051' failed: error: path '/
buildbot/nix-build gitea:clan/clan-core#checks.aarch64-linux.garage error: build of '/nix/store/pxwv2ysglq7205k0pn3rzmv4k07k9nz9-merged-test-dir-garage.drv^out' failed: error: gave up after 9 reschedules
buildbot/nix-build gitea:clan/clan-core#checks.aarch64-linux.localbackup error: build of '/nix/store/5m2vgn4i1s4amwk8pnrgs25mzmiqbvr0-merged-test-dir-localbackup.drv^out' failed: error: error: gRPC AddMultipleToStore on 'nix-store.geninf.io:50051' failed: error: path '/nix
buildbot/nix-build gitea:clan/clan-core#checks.aarch64-linux.monitoring error: build of '/nix/store/zxbvacfhq72cfbwqbkvps2lqr6z2nfcm-merged-test-dir-monitoring.drv^out' failed: error: gave up after 9 reschedules
buildbot/nix-build gitea:clan/clan-core#checks.aarch64-linux.certificates error: build of '/nix/store/4cjqx89wv5gl1n537rqbfylvxh7brw05-merged-test-dir-certificates.drv^out' failed: error: error: gRPC AddMultipleToStore on 'nix-store.geninf.io:50051' failed: error: path '/ni
buildbot/nix-build gitea:clan/clan-core#checks.aarch64-linux.service-dummy-test-from-flake error: build of '/nix/store/1dannijgk3pn19dzpad13p17lhqca1nl-merged-test-dir-service-dummy-test-from-flake.drv^out' failed: error: gave up after 9 reschedules
buildbot/nix-build gitea:clan/clan-core#checks.aarch64-linux.dyndns error: build of '/nix/store/q1h8mm06ana3jj6ljhmhy9apaa9h0kli-merged-test-dir-dyndns.drv^out' failed: error: error: gRPC AddMultipleToStore on 'nix-store.geninf.io:50051' failed: error: path '/nix/stor
buildbot/nix-build gitea:clan/clan-core#checks.aarch64-linux.machine-id error: build of '/nix/store/xh8bqz8463ag3rml28aln1fwahy9phhj-merged-test-dir-service-machine-id.drv^out' failed: error: error: gRPC AddMultipleToStore on 'nix-store.geninf.io:50051' failed: error: pat
buildbot/nix-build gitea:clan/clan-core#checks.aarch64-linux.packages error: build of '/nix/store/nyz3rmrrm4qcxdwbln0414mkr6ldfpqa-merged-test-dir-packages.drv^out' failed: error: error: gRPC AddMultipleToStore on 'nix-store.geninf.io:50051' failed: error: path '/nix/st
buildbot/nix-build gitea:clan/clan-core#checks.aarch64-linux.sshd error: build of '/nix/store/zs4n7j21fmqm1ylli4k5bzv0blvwa0b1-merged-test-dir-sshd.drv^out' failed: error: error: gRPC AddMultipleToStore on 'nix-store.geninf.io:50051' failed: error: path '/nix/store/
buildbot/nix-build gitea:clan/clan-core#checks.aarch64-linux.nixos-test-password-store-mounts error: build of '/nix/store/fd4w6z1djq3452qfd2yvp55jcbvcfrmg-merged-test-dir-nixos-test-password-store-mounts.drv^out' failed: error: error: gRPC AddMultipleToStore on 'nix-store.geninf.io:50051' fail
buildbot/nix-build gitea:clan/clan-core#checks.aarch64-linux.postgresql error: build of '/nix/store/5iibba5p38fym6ym62k83fx13cnqvabv-merged-test-dir-service-postgresql.drv^out' failed: error: error: gRPC AddMultipleToStore on 'nix-store.geninf.io:50051' failed: error: pat
buildbot/nix-build gitea:clan/clan-core#checks.aarch64-linux.state-version error: build of '/nix/store/qjlaaplnjd8nacvm4ncscjyl2ixpdnhp-merged-test-dir-service-state-version.drv^out' failed: error: error: gRPC AddMultipleToStore on 'nix-store.geninf.io:50051' failed: error:
buildbot/nix-build gitea:clan/clan-core#checks.aarch64-linux.sshd-no-ca error: build of '/nix/store/avs3c65z02f9gg37cj2lf2qy48pvvlmc-merged-test-dir-sshd.drv^out' failed: error: error: gRPC AddMultipleToStore on 'nix-store.geninf.io:50051' failed: error: path '/nix/store/
buildbot/nix-build gitea:clan/clan-core#checks.aarch64-linux.p2p-ssh-iroh error: build of '/nix/store/g1ydbrlzfvbi1y56lscz5z0n0s495y26-merged-test-dir-clan-test-p2p-ssh-iroh.drv^out' failed: error: error: gRPC AddMultipleToStore on 'nix-store.geninf.io:50051' failed: error:
buildbot/nix-build gitea:clan/clan-core#checks.aarch64-linux.trusted-nix-caches error: build of '/nix/store/dpb92ps6qqwgi1mfb9sp3p8d0ckj9nn3-merged-test-dir-trusted-nix-caches.drv^out' failed: error: error: gRPC AddMultipleToStore on 'nix-store.geninf.io:50051' failed: error: pat
buildbot/nix-build gitea:clan/clan-core#checks.aarch64-linux.ncps error: build of '/nix/store/xcqvs306r9b9384ybng2iznhxssi40q1-merged-test-dir-ncps.drv^out' failed: error: error: gRPC AddMultipleToStore on 'nix-store.geninf.io:50051' failed: error: path '/nix/store/
buildbot/nix-build gitea:clan/clan-core#checks.aarch64-linux.wireguard error: build of '/nix/store/5wfp9wvkv2k4xjhxygwlp45dvxzpc8kg-merged-test-dir-wireguard.drv^out' failed: error: error: gRPC AddMultipleToStore on 'nix-store.geninf.io:50051' failed: error: path '/nix/s
buildbot/nix-build gitea:clan/clan-core#checks.aarch64-linux.zerotier error: build of '/nix/store/2y0qla7jnff6jkkbmqzj924kfcyr5d9h-merged-test-dir-zerotier.drv^out' failed: error: error: gRPC AddMultipleToStore on 'nix-store.geninf.io:50051' failed: error: path '/nix/st
buildbot/nix-build gitea:clan/clan-core#checks.x86_64-linux.admin error: build of '/nix/store/zl84skhp27xnl77b62lzjihlbq07vryd-merged-test-dir-admin.drv^out' failed: error: gave up after 9 reschedules
buildbot/nix-build gitea:clan/clan-core#checks.aarch64-linux.mycelium error: build of '/nix/store/xqzx5sw4sqqflh84m47lx6fcajavz3s3-merged-test-dir-mycelium.drv^out' failed: error: gave up after 9 reschedules
buildbot/nix-build gitea:clan/clan-core#checks.aarch64-linux.service-dummy-test error: build of '/nix/store/z9naskk0hp6d2q9xbqc6m55zqa3y7vhr-merged-test-dir-service-dummy-test.drv^out' failed: error: gave up after 9 reschedules
buildbot/nix-build gitea:clan/clan-core#checks.aarch64-linux.yggdrasil error: build of '/nix/store/ys05v6p3b2h4kv99fjkmryckr8x6zq4d-merged-test-dir-yggdrasil.drv^out' failed: error: error: gRPC AddMultipleToStore on 'nix-store.geninf.io:50051' failed: error: path '/nix/s
buildbot/nix-build gitea:clan/clan-core#checks.aarch64-linux.syncthing-service error: build of '/nix/store/7pq323b8ncdqa64xkh24ryldvpyqzmxx-merged-test-dir-syncthing-service.drv^out' failed: error: gave up after 9 reschedules
buildbot/nix-build gitea:clan/clan-core#checks.aarch64-linux.pki error: build of '/nix/store/w8kr1wjhbsz621nwm6cchg61w4hpfsa2-merged-test-dir-pki.drv^out' failed: error: gave up after 9 reschedules
buildbot/nix-build gitea:clan/clan-core#checks.aarch64-linux.users error: build of '/nix/store/74mgk3pp0ff54g80wqfdmxfp0cl282k4-merged-test-dir-users.drv^out' failed: error: gave up after 9 reschedules
buildbot/nix-build gitea:clan/clan-core#checks.aarch64-linux.wifi error: build of '/nix/store/5afm43bgg3cqc6a3640y3kz1vkd43swn-merged-test-dir-wifi.drv^out' failed: error: gave up after 9 reschedules
buildbot/nix-build gitea:clan/clan-core#checks.aarch64-linux.zerotier-multi-instance error: build of '/nix/store/zi7hx8rgbdz0gqjrz64hsyv4l8lk9vgb-merged-test-dir-zerotier-multi-instance.drv^out' failed: error: gave up after 9 reschedules
buildbot/nix-build gitea:clan/clan-core#checks.x86_64-linux.matrix-synapse error: build of '/nix/store/sdl93209s82p5xhn4v9294pv3hf185c5-merged-test-dir-matrix-synapse.drv^out' failed: error: gave up after 9 reschedules
buildbot/nix-build gitea:clan/clan-core#checks.x86_64-linux.monitoring error: build of '/nix/store/pk6c6n73k6gbg9idc748ca11w67cxmwj-merged-test-dir-monitoring.drv^out' failed: error: gave up after 9 reschedules
buildbot/nix-build 63 of 150 attributes failed
Update nixpkgs
buildbot/nix-eval evaluation succeeded in 5m 7s (3 warnings)
buildbot/nix-build gitea:clan/clan-core#checks.aarch64-linux.all-packages }
buildbot/nix-build gitea:clan/clan-core#checks.x86_64-linux.all-packages }
buildbot/nix-build gitea:clan/clan-core#checks.x86_64-linux.clan-site-lint }
buildbot/nix-build gitea:clan/clan-core#checks.x86_64-linux.devShell-docs }
buildbot/nix-build gitea:clan/clan-core#checks.x86_64-linux.devShell-clan-site }
buildbot/nix-build gitea:clan/clan-core#checks.x86_64-linux.nixos-test-user-firewall-nftables failed
buildbot/nix-build gitea:clan/clan-core#checks.aarch64-linux.clan-site-lint }
buildbot/nix-build gitea:clan/clan-core#checks.x86_64-linux.wifi failed
buildbot/nix-build gitea:clan/clan-core#checks.aarch64-linux.devShell-clan-site }
buildbot/nix-build gitea:clan/clan-core#checks.aarch64-linux.devShell-docs }
buildbot/nix-build gitea:clan/clan-core#checks.aarch64-darwin.devShell-clan-site }
buildbot/nix-build gitea:clan/clan-core#checks.aarch64-darwin.all-packages }
buildbot/nix-build 12 of 165 attributes failed
mq
waiting
#8147
opened 2026-09-27 21:38:16 +00:00 by afterthought
0 / 10
5 waiting reviews
10 conflicting files
WIP: [Experinment, do not merge!]: Age only secrets
PR Size Review Check / pr-size-review-gate (pull_request) Failing after 6s
label-pr / external (pull_request_target) Successful in 5s
sizelint on each commit / sizelint (pull_request) Successful in 10s
buildbot/nix-eval evaluation succeeded in 4m 12s (1 warning)
buildbot/nix-build gitea:clan/clan-core#checks.aarch64-darwin.treefmt failed
buildbot/nix-build gitea:clan/clan-core#checks.aarch64-linux.clan-pytest-with-core failed
buildbot/nix-build gitea:clan/clan-core#checks.aarch64-linux.treefmt failed
buildbot/nix-build gitea:clan/clan-core#checks.aarch64-linux.all-packages failed
buildbot/nix-build gitea:clan/clan-core#checks.aarch64-linux.clan-test-iso failed
buildbot/nix-build gitea:clan/clan-core#checks.x86_64-linux.all-packages failed
buildbot/nix-build gitea:clan/clan-core#checks.x86_64-linux.clan-pytest-with-core failed
buildbot/nix-build gitea:clan/clan-core#checks.x86_64-linux.clan-test-iso failed
buildbot/nix-build gitea:clan/clan-core#checks.x86_64-linux.treefmt failed
buildbot/nix-build gitea:clan/clan-core#checks.x86_64-linux.template-minimal succeeded
buildbot/nix-build gitea:clan/clan-core#checks.x86_64-linux.service-dummy-test succeeded
buildbot/nix-build gitea:clan/clan-core#checks.x86_64-linux.sshd-no-ca succeeded
buildbot/nix-build gitea:clan/clan-core#checks.x86_64-linux.service-dummy-test-from-flake succeeded
buildbot/nix-build gitea:clan/clan-core#checks.x86_64-linux.yggdrasil succeeded
buildbot/nix-build gitea:clan/clan-core#checks.x86_64-linux.zerotier-multi-instance succeeded
buildbot/nix-build gitea:clan/clan-core#checks.x86_64-linux.zerotier succeeded
buildbot/nix-build gitea:clan/clan-core#checks.x86_64-linux.wireguard succeeded
buildbot/nix-build gitea:clan/clan-core#checks.aarch64-linux.borgbackup succeeded
buildbot/nix-build gitea:clan/clan-core#checks.aarch64-linux.clan-site-lint failed
buildbot/nix-build gitea:clan/clan-core#checks.x86_64-linux.clan-site-lint failed
buildbot/nix-build gitea:clan/clan-core#checks.aarch64-linux.admin succeeded
buildbot/nix-build gitea:clan/clan-core#checks.aarch64-linux.hello-service succeeded
buildbot/nix-build gitea:clan/clan-core#checks.aarch64-linux.garage succeeded
buildbot/nix-build gitea:clan/clan-core#checks.aarch64-linux.dm-dns succeeded
buildbot/nix-build gitea:clan/clan-core#checks.aarch64-linux.matrix-synapse succeeded
buildbot/nix-build gitea:clan/clan-core#checks.aarch64-linux.certificates succeeded
buildbot/nix-build gitea:clan/clan-core#checks.aarch64-linux.localbackup succeeded
buildbot/nix-build gitea:clan/clan-core#checks.aarch64-linux.kde succeeded
buildbot/nix-build gitea:clan/clan-core#checks.aarch64-linux.dyndns succeeded
buildbot/nix-build gitea:clan/clan-core#checks.aarch64-linux.machine-id succeeded
buildbot/nix-build gitea:clan/clan-core#checks.aarch64-linux.packages succeeded
buildbot/nix-build gitea:clan/clan-core#checks.aarch64-linux.data-mesher succeeded
buildbot/nix-build gitea:clan/clan-core#checks.aarch64-linux.service-dummy-test succeeded
buildbot/nix-build gitea:clan/clan-core#checks.aarch64-linux.mycelium succeeded
buildbot/nix-build gitea:clan/clan-core#checks.aarch64-linux.p2p-ssh-iroh succeeded
buildbot/nix-build gitea:clan/clan-core#checks.aarch64-linux.monitoring succeeded
buildbot/nix-build gitea:clan/clan-core#checks.aarch64-linux.state-version succeeded
buildbot/nix-build gitea:clan/clan-core#checks.aarch64-linux.service-dummy-test-from-flake succeeded
buildbot/nix-build gitea:clan/clan-core#checks.aarch64-linux.sshd-no-ca succeeded
buildbot/nix-build gitea:clan/clan-core#checks.aarch64-linux.sshd succeeded
buildbot/nix-build gitea:clan/clan-core#checks.aarch64-linux.users succeeded
buildbot/nix-build gitea:clan/clan-core#checks.aarch64-linux.trusted-nix-caches succeeded
buildbot/nix-build gitea:clan/clan-core#checks.aarch64-linux.pki succeeded
buildbot/nix-build gitea:clan/clan-core#checks.aarch64-linux.ncps succeeded
buildbot/nix-build gitea:clan/clan-core#checks.aarch64-linux.postgresql succeeded
buildbot/nix-build gitea:clan/clan-core#checks.aarch64-linux.wifi succeeded
buildbot/nix-build gitea:clan/clan-core#checks.aarch64-linux.zerotier-multi-instance succeeded
buildbot/nix-build gitea:clan/clan-core#checks.aarch64-linux.zerotier succeeded
buildbot/nix-build gitea:clan/clan-core#checks.x86_64-linux.admin succeeded
buildbot/nix-build gitea:clan/clan-core#checks.aarch64-linux.syncthing-service succeeded
buildbot/nix-build gitea:clan/clan-core#checks.aarch64-linux.wireguard succeeded
buildbot/nix-build gitea:clan/clan-core#checks.aarch64-linux.yggdrasil succeeded
buildbot/nix-build gitea:clan/clan-core#checks.x86_64-linux.certificates succeeded
buildbot/nix-build gitea:clan/clan-core#checks.x86_64-linux.borgbackup succeeded
buildbot/nix-build gitea:clan/clan-core#checks.x86_64-linux.data-mesher succeeded
buildbot/nix-build gitea:clan/clan-core#checks.x86_64-linux.clan-test-update succeeded
buildbot/nix-build gitea:clan/clan-core#checks.x86_64-linux.garage succeeded
buildbot/nix-build gitea:clan/clan-core#checks.x86_64-linux.kde succeeded
buildbot/nix-build gitea:clan/clan-core#checks.x86_64-linux.dyndns succeeded
buildbot/nix-build gitea:clan/clan-core#checks.x86_64-linux.dm-dns succeeded
buildbot/nix-build gitea:clan/clan-core#checks.x86_64-linux.hello-service succeeded
buildbot/nix-build gitea:clan/clan-core#checks.x86_64-linux.machine-id succeeded
buildbot/nix-build gitea:clan/clan-core#checks.x86_64-linux.localbackup succeeded
buildbot/nix-build gitea:clan/clan-core#checks.x86_64-linux.matrix-synapse succeeded
buildbot/nix-build gitea:clan/clan-core#checks.x86_64-linux.mycelium succeeded
buildbot/nix-build gitea:clan/clan-core#checks.x86_64-linux.monitoring succeeded
buildbot/nix-build gitea:clan/clan-core#checks.x86_64-linux.ncps succeeded
buildbot/nix-build gitea:clan/clan-core#checks.x86_64-linux.pki succeeded
buildbot/nix-build gitea:clan/clan-core#checks.x86_64-linux.p2p-ssh-iroh succeeded
buildbot/nix-build gitea:clan/clan-core#checks.x86_64-linux.packages succeeded
buildbot/nix-build gitea:clan/clan-core#checks.x86_64-linux.state-version succeeded
buildbot/nix-build gitea:clan/clan-core#checks.x86_64-linux.trusted-nix-caches succeeded
buildbot/nix-build gitea:clan/clan-core#checks.x86_64-linux.users succeeded
buildbot/nix-build gitea:clan/clan-core#checks.x86_64-linux.postgresql succeeded
buildbot/nix-build gitea:clan/clan-core#checks.x86_64-linux.sshd succeeded
buildbot/nix-build gitea:clan/clan-core#checks.x86_64-linux.wifi succeeded
buildbot/nix-build gitea:clan/clan-core#checks.x86_64-linux.syncthing-service succeeded
buildbot/nix-build 11 of 144 attributes failed
clan machines build --format sd-card: fix image lookup, add secret injection
PR Size Review Check / pr-size-review-gate (pull_request) Failing after 19s
sizelint on each commit / sizelint (pull_request) Successful in 37s
buildbot/nix-eval evaluation succeeded in 4m 4s (2 warnings)
buildbot/nix-build gitea:clan/clan-core#checks.aarch64-linux.clan-pytest-with-core failed
buildbot/nix-build gitea:clan/clan-core#checks.aarch64-darwin.clan-pytest-without-core failed
buildbot/nix-build gitea:clan/clan-core#checks.aarch64-linux.clan-pytest-without-core failed
buildbot/nix-build gitea:clan/clan-core#checks.x86_64-linux.clan-pytest-with-core failed
buildbot/nix-build gitea:clan/clan-core#checks.x86_64-linux.clan-pytest-without-core failed
buildbot/nix-build 5 of 152 attributes failed
Type
Community Contribution
1
flake: lock the select cache so concurrent selects are safe
label-pr / external (pull_request_target) Successful in 18s
buildbot/nix-eval evaluation succeeded in 1m 27s (3 warnings)
buildbot/nix-build gitea:clan/clan-core#checks.aarch64-darwin.treefmt failed
buildbot/nix-build gitea:clan/clan-core#checks.aarch64-linux.treefmt failed
buildbot/nix-build gitea:clan/clan-core#checks.x86_64-linux.treefmt failed
buildbot/nix-build 3 of 150 attributes failed
PR Size Review Check / pr-size-review-gate (pull_request) Canceled after 0s
sizelint on each commit / sizelint (pull_request) Canceled after 0s
Type
Community Contribution
1
postgresql: skip the restore stop hook when no units are listed
PR Size Review Check / pr-size-review-gate (pull_request) Successful in 20s
sizelint on each commit / sizelint (pull_request) Successful in 25s
label-pr / external (pull_request_target) Successful in 18s
buildbot/nix-eval evaluation succeeded in 1m 28s (3 warnings)
buildbot/nix-build gitea:clan/clan-core#checks.x86_64-linux.clan-pytest-with-core failed
buildbot/nix-build 1 of 150 attributes failed
secrets: reject "." and ".." as secret names
label-pr / external (pull_request_target) Successful in 16s
sizelint on each commit / sizelint (pull_request) Successful in 21s
PR Size Review Check / pr-size-review-gate (pull_request) Successful in 1m15s
buildbot/nix-eval evaluation succeeded in 1m 8s (3 warnings)
buildbot/nix-build gitea:clan/clan-core#checks.x86_64-linux.clan-pytest-with-core succeeded
buildbot/nix-build 150 attributes built
gitea-mq/buildbot/nix-eval evaluation succeeded in 1m 12s (3 warnings)
gitea-mq/buildbot/nix-build gitea:clan/clan-core#checks.x86_64-linux.clan-pytest-with-core failed
gitea-mq/buildbot/nix-build 1 of 150 attributes failed
gitea-mq Check failed: buildbot/nix-build
machines: build get_machine's tag map from the machine name
PR Size Review Check / pr-size-review-gate (pull_request) Successful in 18s
sizelint on each commit / sizelint (pull_request) Successful in 23s
label-pr / external (pull_request_target) Successful in 20s
buildbot/nix-eval evaluation succeeded in 1m 8s (3 warnings)
buildbot/nix-build gitea:clan/clan-core#checks.x86_64-linux.clan-pytest-with-core failed
buildbot/nix-build 1 of 150 attributes failed
mq
waiting
exports: reject a colon anywhere in a scope part
PR Size Review Check / pr-size-review-gate (pull_request) Successful in 14s
sizelint on each commit / sizelint (pull_request) Successful in 18s
buildbot/nix-eval evaluation succeeded in 1m 13s (3 warnings)
label-pr / external (pull_request_target) Successful in 6m26s
buildbot/nix-build 150 attributes built
gitea-mq/buildbot/nix-eval evaluation succeeded in 7m 37s (50 warnings)
gitea-mq/buildbot/nix-build gitea:clan/clan-core#checks.aarch64-darwin.clan-pytest-with-core failed
gitea-mq/buildbot/nix-build gitea:clan/clan-core#checks.aarch64-linux.clan-pytest-with-core failed
gitea-mq/buildbot/nix-build gitea:clan/clan-core#checks.aarch64-darwin.treefmt failed
gitea-mq/buildbot/nix-build gitea:clan/clan-core#checks.aarch64-linux.dm-dns error: build of '/nix/store/d5almx1kbj048lc954ydsais4g48mjcj-merged-test-dir-dm-dns.drv^out' failed: error: gave up after 9 reschedules
gitea-mq/buildbot/nix-build gitea:clan/clan-core#checks.aarch64-darwin.devShell-clan-site failed
gitea-mq/buildbot/nix-build gitea:clan/clan-core#checks.aarch64-linux.localbackup error: build of '/nix/store/5m2vgn4i1s4amwk8pnrgs25mzmiqbvr0-merged-test-dir-localbackup.drv^out' failed: error: gave up after 9 reschedules
gitea-mq/buildbot/nix-build gitea:clan/clan-core#checks.aarch64-linux.data-mesher error: build of '/nix/store/vix2rxv6qbhxbzhdcraiaik9j9fk50bj-merged-test-dir-data-mesher.drv^out' failed: error: gave up after 9 reschedules
gitea-mq/buildbot/nix-build gitea:clan/clan-core#checks.aarch64-linux.all-packages failed
gitea-mq/buildbot/nix-build gitea:clan/clan-core#checks.aarch64-linux.machine-id error: build of '/nix/store/xh8bqz8463ag3rml28aln1fwahy9phhj-merged-test-dir-service-machine-id.drv^out' failed: error: gave up after 9 reschedules
gitea-mq/buildbot/nix-build gitea:clan/clan-core#checks.aarch64-linux.garage error: build of '/nix/store/pxwv2ysglq7205k0pn3rzmv4k07k9nz9-merged-test-dir-garage.drv^out' failed: error: gave up after 9 reschedules
gitea-mq/buildbot/nix-build gitea:clan/clan-core#checks.aarch64-linux.pki error: build of '/nix/store/w8kr1wjhbsz621nwm6cchg61w4hpfsa2-merged-test-dir-pki.drv^out' failed: error: gave up after 9 reschedules
gitea-mq/buildbot/nix-build gitea:clan/clan-core#checks.aarch64-linux.clan-site-lint failed
gitea-mq/buildbot/nix-build gitea:clan/clan-core#checks.aarch64-linux.postgresql error: build of '/nix/store/5iibba5p38fym6ym62k83fx13cnqvabv-merged-test-dir-service-postgresql.drv^out' failed: error: gave up after 9 reschedules
gitea-mq/buildbot/nix-build gitea:clan/clan-core#checks.aarch64-linux.service-dummy-test-from-flake error: build of '/nix/store/1dannijgk3pn19dzpad13p17lhqca1nl-merged-test-dir-service-dummy-test-from-flake.drv^out' failed: error: gave up after 9 reschedules
gitea-mq/buildbot/nix-build gitea:clan/clan-core#checks.aarch64-linux.hello-service error: build of '/nix/store/w57zn5d5mvjpj5m3vx6ha3l25anzmm6j-merged-test-dir-hello-service.drv^out' failed: error: gave up after 9 reschedules
gitea-mq/buildbot/nix-build gitea:clan/clan-core#checks.aarch64-linux.service-dummy-test error: build of '/nix/store/z9naskk0hp6d2q9xbqc6m55zqa3y7vhr-merged-test-dir-service-dummy-test.drv^out' failed: error: gave up after 9 reschedules
gitea-mq/buildbot/nix-build gitea:clan/clan-core#checks.aarch64-linux.devShell-docs failed
gitea-mq/buildbot/nix-build gitea:clan/clan-core#checks.aarch64-linux.syncthing-service error: build of '/nix/store/7pq323b8ncdqa64xkh24ryldvpyqzmxx-merged-test-dir-syncthing-service.drv^out' failed: error: gave up after 9 reschedules
gitea-mq/buildbot/nix-build gitea:clan/clan-core#checks.aarch64-linux.kde error: build of '/nix/store/7ss8jk5j8lvlkvz9z21kmdvs01hrphhs-merged-test-dir-kde.drv^out' failed: error: gave up after 9 reschedules
gitea-mq/buildbot/nix-build gitea:clan/clan-core#checks.x86_64-linux.admin error: build of '/nix/store/zl84skhp27xnl77b62lzjihlbq07vryd-merged-test-dir-admin.drv^out' failed: error: gave up after 9 reschedules
gitea-mq/buildbot/nix-build gitea:clan/clan-core#checks.x86_64-linux.borgbackup error: build of '/nix/store/zivl2hinxs22isnb9dsqbllzg1228q3c-merged-test-dir-borgbackup.drv^out' failed: error: gave up after 9 reschedules
gitea-mq/buildbot/nix-build gitea:clan/clan-core#checks.aarch64-darwin.all-packages failed
gitea-mq/buildbot/nix-build gitea:clan/clan-core#checks.aarch64-linux.mycelium error: build of '/nix/store/xqzx5sw4sqqflh84m47lx6fcajavz3s3-merged-test-dir-mycelium.drv^out' failed: error: gave up after 9 reschedules
gitea-mq/buildbot/nix-build gitea:clan/clan-core#checks.aarch64-linux.users error: build of '/nix/store/74mgk3pp0ff54g80wqfdmxfp0cl282k4-merged-test-dir-users.drv^out' failed: error: gave up after 9 reschedules
gitea-mq/buildbot/nix-build gitea:clan/clan-core#checks.aarch64-linux.wifi error: build of '/nix/store/5afm43bgg3cqc6a3640y3kz1vkd43swn-merged-test-dir-wifi.drv^out' failed: error: gave up after 9 reschedules
gitea-mq/buildbot/nix-build gitea:clan/clan-core#checks.aarch64-linux.clan-test-iso failed
gitea-mq/buildbot/nix-build gitea:clan/clan-core#checks.aarch64-linux.dyndns error: build of '/nix/store/q1h8mm06ana3jj6ljhmhy9apaa9h0kli-merged-test-dir-dyndns.drv^out' failed: error: error: gRPC AddMultipleToStore on 'nix-store.geninf.io:50051' failed: error: path '/nix/stor
gitea-mq/buildbot/nix-build gitea:clan/clan-core#checks.aarch64-linux.borgbackup error: build of '/nix/store/yzllyxpx7yx5charhhknhx1h80dgzrks-merged-test-dir-borgbackup.drv^out' failed: error: gave up after 9 reschedules
gitea-mq/buildbot/nix-build gitea:clan/clan-core#checks.aarch64-linux.state-version error: build of '/nix/store/qjlaaplnjd8nacvm4ncscjyl2ixpdnhp-merged-test-dir-service-state-version.drv^out' failed: error: gave up after 9 reschedules
gitea-mq/buildbot/nix-build gitea:clan/clan-core#checks.aarch64-linux.p2p-ssh-iroh error: build of '/nix/store/g1ydbrlzfvbi1y56lscz5z0n0s495y26-merged-test-dir-clan-test-p2p-ssh-iroh.drv^out' failed: error: error: gRPC AddMultipleToStore on 'nix-store.geninf.io:50051' failed: error:
gitea-mq/buildbot/nix-build gitea:clan/clan-core#checks.aarch64-darwin.eval-tests failed
gitea-mq/buildbot/nix-build gitea:clan/clan-core#checks.aarch64-linux.monitoring error: build of '/nix/store/zxbvacfhq72cfbwqbkvps2lqr6z2nfcm-merged-test-dir-monitoring.drv^out' failed: error: gave up after 9 reschedules
gitea-mq/buildbot/nix-build gitea:clan/clan-core#checks.aarch64-linux.nixos-test-password-store-mounts error: build of '/nix/store/fd4w6z1djq3452qfd2yvp55jcbvcfrmg-merged-test-dir-nixos-test-password-store-mounts.drv^out' failed: error: error: gRPC AddMultipleToStore on 'nix-store.geninf.io:50051' fail
gitea-mq/buildbot/nix-build gitea:clan/clan-core#checks.aarch64-linux.zerotier-multi-instance error: build of '/nix/store/zi7hx8rgbdz0gqjrz64hsyv4l8lk9vgb-merged-test-dir-zerotier-multi-instance.drv^out' failed: error: gave up after 9 reschedules
gitea-mq/buildbot/nix-build gitea:clan/clan-core#checks.aarch64-linux.devShell-clan-site failed
gitea-mq/buildbot/nix-build gitea:clan/clan-core#checks.aarch64-linux.sshd error: build of '/nix/store/zs4n7j21fmqm1ylli4k5bzv0blvwa0b1-merged-test-dir-sshd.drv^out' failed: error: error: gRPC AddMultipleToStore on 'nix-store.geninf.io:50051' failed: error: path '/nix/store/
gitea-mq/buildbot/nix-build gitea:clan/clan-core#checks.aarch64-linux.certificates error: build of '/nix/store/4cjqx89wv5gl1n537rqbfylvxh7brw05-merged-test-dir-certificates.drv^out' failed: error: error: gRPC AddMultipleToStore on 'nix-store.geninf.io:50051' failed: error: path '/ni
gitea-mq/buildbot/nix-build gitea:clan/clan-core#checks.x86_64-linux.dyndns error: build of '/nix/store/hijqbkrw6bdhd7i3nl64xzd4ldkxna0g-merged-test-dir-dyndns.drv^out' failed: error: gave up after 9 reschedules
gitea-mq/buildbot/nix-build gitea:clan/clan-core#checks.aarch64-linux.sshd-no-ca error: build of '/nix/store/avs3c65z02f9gg37cj2lf2qy48pvvlmc-merged-test-dir-sshd.drv^out' failed: error: error: gRPC AddMultipleToStore on 'nix-store.geninf.io:50051' failed: error: path '/nix/store/
gitea-mq/buildbot/nix-build gitea:clan/clan-core#checks.x86_64-linux.garage error: build of '/nix/store/hyijhzy1ws3zn2n62vxpx45kps0b8l2m-merged-test-dir-garage.drv^out' failed: error: gave up after 9 reschedules
gitea-mq/buildbot/nix-build gitea:clan/clan-core#checks.aarch64-linux.admin error: build of '/nix/store/nzljmbmyjqam1ricrqlv38l0a7w6vr4z-merged-test-dir-admin.drv^out' failed: error: error: gRPC AddMultipleToStore on 'nix-store.geninf.io:50051' failed: error: path '/nix/store
gitea-mq/buildbot/nix-build gitea:clan/clan-core#checks.x86_64-linux.monitoring error: build of '/nix/store/pk6c6n73k6gbg9idc748ca11w67cxmwj-merged-test-dir-monitoring.drv^out' failed: error: gave up after 9 reschedules
gitea-mq/buildbot/nix-build gitea:clan/clan-core#checks.aarch64-linux.matrix-synapse error: build of '/nix/store/86asji4bmwf0nk34wr94a16h090d08mi-merged-test-dir-matrix-synapse.drv^out' failed: error: error: gRPC AddMultipleToStore on 'nix-store.geninf.io:50051' failed: error: path '/
gitea-mq/buildbot/nix-build gitea:clan/clan-core#checks.x86_64-linux.packages error: build of '/nix/store/0znb3q62jw8kp0lp8yzvksx4xg0ykvmy-merged-test-dir-packages.drv^out' failed: error: error: gRPC AddMultipleToStore on 'nix-store.geninf.io:50051' failed: error: path '/nix/st
gitea-mq/buildbot/nix-build gitea:clan/clan-core#checks.x86_64-linux.ncps error: build of '/nix/store/n45h6kvx18h3iigq74lv8a1gyc50kwma-merged-test-dir-ncps.drv^out' failed: error: gave up after 9 reschedules
gitea-mq/buildbot/nix-build gitea:clan/clan-core#checks.x86_64-linux.matrix-synapse error: build of '/nix/store/sdl93209s82p5xhn4v9294pv3hf185c5-merged-test-dir-matrix-synapse.drv^out' failed: error: gave up after 9 reschedules
gitea-mq/buildbot/nix-build 57 of 150 attributes failed
gitea-mq/buildbot/nix-build gitea:clan/clan-core#checks.x86_64-linux.service-dummy-test error: build of '/nix/store/czlliyn8fcyjsg46j3ls7fyn7m0hwb2v-merged-test-dir-service-dummy-test.drv^out' failed: error: gave up after 9 reschedules
gitea-mq Check failed: buildbot/nix-build
errors: give ClanCmdError a message the API can render
PR Size Review Check / pr-size-review-gate (pull_request) Successful in 15s
sizelint on each commit / sizelint (pull_request) Successful in 19s
buildbot/nix-eval evaluation succeeded in 1m 19s (3 warnings)
label-pr / external (pull_request_target) Successful in 15s
buildbot/nix-build 150 attributes built
gitea-mq/buildbot/nix-eval evaluation succeeded in 3m 25s (50 warnings)
gitea-mq/buildbot/nix-build gitea:clan/clan-core#checks.aarch64-darwin.eval-tests failed
gitea-mq/buildbot/nix-build gitea:clan/clan-core#checks.aarch64-linux.all-packages failed
gitea-mq/buildbot/nix-build gitea:clan/clan-core#checks.aarch64-linux.borgbackup error: build of '/nix/store/yzllyxpx7yx5charhhknhx1h80dgzrks-merged-test-dir-borgbackup.drv^out' failed: error: gave up after 9 reschedules
gitea-mq/buildbot/nix-build gitea:clan/clan-core#checks.aarch64-darwin.devShell-clan-site failed
gitea-mq/buildbot/nix-build gitea:clan/clan-core#checks.aarch64-linux.hello-service error: build of '/nix/store/w57zn5d5mvjpj5m3vx6ha3l25anzmm6j-merged-test-dir-hello-service.drv^out' failed: error: gave up after 9 reschedules
gitea-mq/buildbot/nix-build gitea:clan/clan-core#checks.aarch64-linux.admin error: build of '/nix/store/nzljmbmyjqam1ricrqlv38l0a7w6vr4z-merged-test-dir-admin.drv^out' failed: error: error: gRPC AddMultipleToStore on 'nix-store.geninf.io:50051' failed: error: path '/nix/store
gitea-mq/buildbot/nix-build gitea:clan/clan-core#checks.aarch64-linux.monitoring error: build of '/nix/store/zxbvacfhq72cfbwqbkvps2lqr6z2nfcm-merged-test-dir-monitoring.drv^out' failed: error: gave up after 9 reschedules
gitea-mq/buildbot/nix-build gitea:clan/clan-core#checks.aarch64-darwin.clan-pytest-with-core failed
gitea-mq/buildbot/nix-build gitea:clan/clan-core#checks.aarch64-linux.mycelium error: build of '/nix/store/xqzx5sw4sqqflh84m47lx6fcajavz3s3-merged-test-dir-mycelium.drv^out' failed: error: gave up after 9 reschedules
gitea-mq/buildbot/nix-build gitea:clan/clan-core#checks.aarch64-linux.certificates error: build of '/nix/store/4cjqx89wv5gl1n537rqbfylvxh7brw05-merged-test-dir-certificates.drv^out' failed: error: error: gRPC AddMultipleToStore on 'nix-store.geninf.io:50051' failed: error: path '/ni
gitea-mq/buildbot/nix-build gitea:clan/clan-core#checks.aarch64-linux.pki error: build of '/nix/store/w8kr1wjhbsz621nwm6cchg61w4hpfsa2-merged-test-dir-pki.drv^out' failed: error: gave up after 9 reschedules
gitea-mq/buildbot/nix-build gitea:clan/clan-core#checks.aarch64-linux.matrix-synapse error: build of '/nix/store/86asji4bmwf0nk34wr94a16h090d08mi-merged-test-dir-matrix-synapse.drv^out' failed: error: error: gRPC AddMultipleToStore on 'nix-store.geninf.io:50051' failed: error: path '/
gitea-mq/buildbot/nix-build gitea:clan/clan-core#checks.aarch64-linux.data-mesher error: build of '/nix/store/vix2rxv6qbhxbzhdcraiaik9j9fk50bj-merged-test-dir-data-mesher.drv^out' failed: error: gave up after 9 reschedules
gitea-mq/buildbot/nix-build gitea:clan/clan-core#checks.aarch64-linux.clan-test-iso failed
gitea-mq/buildbot/nix-build gitea:clan/clan-core#checks.aarch64-linux.kde error: build of '/nix/store/7ss8jk5j8lvlkvz9z21kmdvs01hrphhs-merged-test-dir-kde.drv^out' failed: error: gave up after 9 reschedules
gitea-mq/buildbot/nix-build gitea:clan/clan-core#checks.aarch64-linux.state-version error: build of '/nix/store/qjlaaplnjd8nacvm4ncscjyl2ixpdnhp-merged-test-dir-service-state-version.drv^out' failed: error: gave up after 9 reschedules
gitea-mq/buildbot/nix-build gitea:clan/clan-core#checks.aarch64-linux.garage error: build of '/nix/store/pxwv2ysglq7205k0pn3rzmv4k07k9nz9-merged-test-dir-garage.drv^out' failed: error: gave up after 9 reschedules
gitea-mq/buildbot/nix-build gitea:clan/clan-core#checks.aarch64-linux.clan-pytest-with-core failed
gitea-mq/buildbot/nix-build gitea:clan/clan-core#checks.aarch64-linux.postgresql error: build of '/nix/store/5iibba5p38fym6ym62k83fx13cnqvabv-merged-test-dir-service-postgresql.drv^out' failed: error: gave up after 9 reschedules
gitea-mq/buildbot/nix-build gitea:clan/clan-core#checks.aarch64-linux.users error: build of '/nix/store/74mgk3pp0ff54g80wqfdmxfp0cl282k4-merged-test-dir-users.drv^out' failed: error: gave up after 9 reschedules
gitea-mq/buildbot/nix-build gitea:clan/clan-core#checks.aarch64-linux.service-dummy-test error: build of '/nix/store/z9naskk0hp6d2q9xbqc6m55zqa3y7vhr-merged-test-dir-service-dummy-test.drv^out' failed: error: gave up after 9 reschedules
gitea-mq/buildbot/nix-build gitea:clan/clan-core#checks.aarch64-linux.localbackup error: build of '/nix/store/5m2vgn4i1s4amwk8pnrgs25mzmiqbvr0-merged-test-dir-localbackup.drv^out' failed: error: gave up after 9 reschedules
gitea-mq/buildbot/nix-build gitea:clan/clan-core#checks.aarch64-darwin.devshell failed
gitea-mq/buildbot/nix-build gitea:clan/clan-core#checks.aarch64-linux.wifi error: build of '/nix/store/5afm43bgg3cqc6a3640y3kz1vkd43swn-merged-test-dir-wifi.drv^out' failed: error: gave up after 9 reschedules
gitea-mq/buildbot/nix-build gitea:clan/clan-core#checks.x86_64-linux.admin error: build of '/nix/store/zl84skhp27xnl77b62lzjihlbq07vryd-merged-test-dir-admin.drv^out' failed: error: gave up after 9 reschedules
gitea-mq/buildbot/nix-build gitea:clan/clan-core#checks.x86_64-linux.borgbackup error: build of '/nix/store/zivl2hinxs22isnb9dsqbllzg1228q3c-merged-test-dir-borgbackup.drv^out' failed: error: gave up after 9 reschedules
gitea-mq/buildbot/nix-build gitea:clan/clan-core#checks.aarch64-linux.machine-id error: build of '/nix/store/xh8bqz8463ag3rml28aln1fwahy9phhj-merged-test-dir-service-machine-id.drv^out' failed: error: gave up after 9 reschedules
gitea-mq/buildbot/nix-build gitea:clan/clan-core#checks.aarch64-darwin.clan-pytest-without-core failed
gitea-mq/buildbot/nix-build gitea:clan/clan-core#checks.aarch64-linux.syncthing-service error: build of '/nix/store/7pq323b8ncdqa64xkh24ryldvpyqzmxx-merged-test-dir-syncthing-service.drv^out' failed: error: gave up after 9 reschedules
gitea-mq/buildbot/nix-build gitea:clan/clan-core#checks.aarch64-linux.nixos-test-password-store-mounts error: build of '/nix/store/fd4w6z1djq3452qfd2yvp55jcbvcfrmg-merged-test-dir-nixos-test-password-store-mounts.drv^out' failed: error: error: gRPC AddMultipleToStore on 'nix-store.geninf.io:50051' fail
gitea-mq/buildbot/nix-build gitea:clan/clan-core#checks.aarch64-linux.service-dummy-test-from-flake error: build of '/nix/store/1dannijgk3pn19dzpad13p17lhqca1nl-merged-test-dir-service-dummy-test-from-flake.drv^out' failed: error: gave up after 9 reschedules
gitea-mq/buildbot/nix-build gitea:clan/clan-core#checks.aarch64-darwin.treefmt failed
gitea-mq/buildbot/nix-build gitea:clan/clan-core#checks.aarch64-linux.dm-dns error: build of '/nix/store/d5almx1kbj048lc954ydsais4g48mjcj-merged-test-dir-dm-dns.drv^out' failed: error: gave up after 9 reschedules
gitea-mq/buildbot/nix-build gitea:clan/clan-core#checks.aarch64-linux.sshd-no-ca error: build of '/nix/store/avs3c65z02f9gg37cj2lf2qy48pvvlmc-merged-test-dir-sshd.drv^out' failed: error: error: gRPC AddMultipleToStore on 'nix-store.geninf.io:50051' failed: error: path '/nix/store/
gitea-mq/buildbot/nix-build gitea:clan/clan-core#checks.aarch64-linux.zerotier-multi-instance error: build of '/nix/store/zi7hx8rgbdz0gqjrz64hsyv4l8lk9vgb-merged-test-dir-zerotier-multi-instance.drv^out' failed: error: gave up after 9 reschedules
gitea-mq/buildbot/nix-build gitea:clan/clan-core#checks.aarch64-darwin.all-packages failed
gitea-mq/buildbot/nix-build gitea:clan/clan-core#checks.aarch64-linux.zerotier error: build of '/nix/store/2y0qla7jnff6jkkbmqzj924kfcyr5d9h-merged-test-dir-zerotier.drv^out' failed: error: error: gRPC AddMultipleToStore on 'nix-store.geninf.io:50051' failed: error: path '/nix/st
gitea-mq/buildbot/nix-build gitea:clan/clan-core#checks.aarch64-linux.p2p-ssh-iroh error: build of '/nix/store/g1ydbrlzfvbi1y56lscz5z0n0s495y26-merged-test-dir-clan-test-p2p-ssh-iroh.drv^out' failed: error: error: gRPC AddMultipleToStore on 'nix-store.geninf.io:50051' failed: error:
gitea-mq/buildbot/nix-build gitea:clan/clan-core#checks.aarch64-linux.yggdrasil error: build of '/nix/store/ys05v6p3b2h4kv99fjkmryckr8x6zq4d-merged-test-dir-yggdrasil.drv^out' failed: error: error: gRPC AddMultipleToStore on 'nix-store.geninf.io:50051' failed: error: path '/nix/s
gitea-mq/buildbot/nix-build gitea:clan/clan-core#checks.x86_64-linux.garage error: build of '/nix/store/hyijhzy1ws3zn2n62vxpx45kps0b8l2m-merged-test-dir-garage.drv^out' failed: error: gave up after 9 reschedules
gitea-mq/buildbot/nix-build gitea:clan/clan-core#checks.x86_64-linux.dyndns error: build of '/nix/store/hijqbkrw6bdhd7i3nl64xzd4ldkxna0g-merged-test-dir-dyndns.drv^out' failed: error: gave up after 9 reschedules
gitea-mq/buildbot/nix-build gitea:clan/clan-core#checks.aarch64-linux.trusted-nix-caches error: build of '/nix/store/dpb92ps6qqwgi1mfb9sp3p8d0ckj9nn3-merged-test-dir-trusted-nix-caches.drv^out' failed: error: error: gRPC AddMultipleToStore on 'nix-store.geninf.io:50051' failed: error: pat
gitea-mq/buildbot/nix-build gitea:clan/clan-core#checks.aarch64-linux.packages error: build of '/nix/store/nyz3rmrrm4qcxdwbln0414mkr6ldfpqa-merged-test-dir-packages.drv^out' failed: error: error: gRPC AddMultipleToStore on 'nix-store.geninf.io:50051' failed: error: path '/nix/st
gitea-mq/buildbot/nix-build gitea:clan/clan-core#checks.aarch64-linux.dyndns error: build of '/nix/store/q1h8mm06ana3jj6ljhmhy9apaa9h0kli-merged-test-dir-dyndns.drv^out' failed: error: error: gRPC AddMultipleToStore on 'nix-store.geninf.io:50051' failed: error: path '/nix/stor
gitea-mq/buildbot/nix-build gitea:clan/clan-core#checks.x86_64-linux.matrix-synapse error: build of '/nix/store/sdl93209s82p5xhn4v9294pv3hf185c5-merged-test-dir-matrix-synapse.drv^out' failed: error: gave up after 9 reschedules
gitea-mq/buildbot/nix-build gitea:clan/clan-core#checks.aarch64-linux.ncps error: build of '/nix/store/xcqvs306r9b9384ybng2iznhxssi40q1-merged-test-dir-ncps.drv^out' failed: error: error: gRPC AddMultipleToStore on 'nix-store.geninf.io:50051' failed: error: path '/nix/store/
gitea-mq/buildbot/nix-build gitea:clan/clan-core#checks.aarch64-linux.sshd error: build of '/nix/store/zs4n7j21fmqm1ylli4k5bzv0blvwa0b1-merged-test-dir-sshd.drv^out' failed: error: error: gRPC AddMultipleToStore on 'nix-store.geninf.io:50051' failed: error: path '/nix/store/
gitea-mq/buildbot/nix-build 56 of 150 attributes failed
gitea-mq Check failed: buildbot/nix-build
borgbackup: require NAME and FOLDERS in borgbackup-restore
PR Size Review Check / pr-size-review-gate (pull_request) Successful in 17s
sizelint on each commit / sizelint (pull_request) Successful in 22s
buildbot/nix-eval evaluation succeeded in 2m 9s (3 warnings)
label-pr / external (pull_request_target) Successful in 18s
buildbot/nix-build 150 attributes built
gitea-mq/buildbot/nix-eval evaluation succeeded in 12m 33s (50 warnings)
gitea-mq/buildbot/nix-build gitea:clan/clan-core#checks.aarch64-darwin.clan-pytest-with-core failed
gitea-mq/buildbot/nix-build gitea:clan/clan-core#checks.aarch64-darwin.devShell-clan-site failed
gitea-mq/buildbot/nix-build gitea:clan/clan-core#checks.aarch64-linux.all-packages failed
gitea-mq/buildbot/nix-build gitea:clan/clan-core#checks.aarch64-darwin.treefmt failed
gitea-mq/buildbot/nix-build gitea:clan/clan-core#checks.aarch64-linux.clan-test-iso failed
gitea-mq/buildbot/nix-build gitea:clan/clan-core#checks.aarch64-linux.admin error: build of '/nix/store/nzljmbmyjqam1ricrqlv38l0a7w6vr4z-merged-test-dir-admin.drv^out' failed: error: error: gRPC AddMultipleToStore on 'nix-store.geninf.io:50051' failed: error: path '/nix/store
gitea-mq/buildbot/nix-build gitea:clan/clan-core#checks.aarch64-linux.clan-pytest-with-core failed
gitea-mq/buildbot/nix-build gitea:clan/clan-core#checks.aarch64-linux.monitoring error: build of '/nix/store/zxbvacfhq72cfbwqbkvps2lqr6z2nfcm-merged-test-dir-monitoring.drv^out' failed: error: gave up after 9 reschedules
gitea-mq/buildbot/nix-build gitea:clan/clan-core#checks.aarch64-linux.garage error: build of '/nix/store/pxwv2ysglq7205k0pn3rzmv4k07k9nz9-merged-test-dir-garage.drv^out' failed: error: gave up after 9 reschedules
gitea-mq/buildbot/nix-build gitea:clan/clan-core#checks.aarch64-linux.certificates error: build of '/nix/store/4cjqx89wv5gl1n537rqbfylvxh7brw05-merged-test-dir-certificates.drv^out' failed: error: error: gRPC AddMultipleToStore on 'nix-store.geninf.io:50051' failed: error: path '/ni
gitea-mq/buildbot/nix-build gitea:clan/clan-core#checks.x86_64-linux.clan-site-lint failed
gitea-mq/buildbot/nix-build gitea:clan/clan-core#checks.aarch64-linux.kde error: build of '/nix/store/7ss8jk5j8lvlkvz9z21kmdvs01hrphhs-merged-test-dir-kde.drv^out' failed: error: gave up after 9 reschedules
gitea-mq/buildbot/nix-build gitea:clan/clan-core#checks.aarch64-linux.dm-dns error: build of '/nix/store/d5almx1kbj048lc954ydsais4g48mjcj-merged-test-dir-dm-dns.drv^out' failed: error: gave up after 9 reschedules
gitea-mq/buildbot/nix-build gitea:clan/clan-core#checks.aarch64-linux.mycelium error: build of '/nix/store/xqzx5sw4sqqflh84m47lx6fcajavz3s3-merged-test-dir-mycelium.drv^out' failed: error: gave up after 9 reschedules
gitea-mq/buildbot/nix-build gitea:clan/clan-core#checks.aarch64-linux.devShell-clan-site failed
gitea-mq/buildbot/nix-build gitea:clan/clan-core#checks.aarch64-linux.hello-service error: build of '/nix/store/w57zn5d5mvjpj5m3vx6ha3l25anzmm6j-merged-test-dir-hello-service.drv^out' failed: error: gave up after 9 reschedules
gitea-mq/buildbot/nix-build gitea:clan/clan-core#checks.aarch64-linux.localbackup error: build of '/nix/store/5m2vgn4i1s4amwk8pnrgs25mzmiqbvr0-merged-test-dir-localbackup.drv^out' failed: error: gave up after 9 reschedules
gitea-mq/buildbot/nix-build gitea:clan/clan-core#checks.aarch64-linux.machine-id error: build of '/nix/store/xh8bqz8463ag3rml28aln1fwahy9phhj-merged-test-dir-service-machine-id.drv^out' failed: error: gave up after 9 reschedules
gitea-mq/buildbot/nix-build gitea:clan/clan-core#checks.aarch64-linux.clan-site-lint failed
gitea-mq/buildbot/nix-build gitea:clan/clan-core#checks.aarch64-linux.pki error: build of '/nix/store/w8kr1wjhbsz621nwm6cchg61w4hpfsa2-merged-test-dir-pki.drv^out' failed: error: gave up after 9 reschedules
gitea-mq/buildbot/nix-build gitea:clan/clan-core#checks.aarch64-linux.borgbackup error: build of '/nix/store/slri7bd5g55kz519mrli1pkc3vk4i8v3-merged-test-dir-borgbackup.drv^out' failed: error: gave up after 9 reschedules
gitea-mq/buildbot/nix-build gitea:clan/clan-core#checks.aarch64-darwin.eval-tests failed
gitea-mq/buildbot/nix-build gitea:clan/clan-core#checks.aarch64-linux.syncthing-service error: build of '/nix/store/7pq323b8ncdqa64xkh24ryldvpyqzmxx-merged-test-dir-syncthing-service.drv^out' failed: error: gave up after 9 reschedules
gitea-mq/buildbot/nix-build gitea:clan/clan-core#checks.aarch64-linux.postgresql error: build of '/nix/store/5iibba5p38fym6ym62k83fx13cnqvabv-merged-test-dir-service-postgresql.drv^out' failed: error: gave up after 9 reschedules
gitea-mq/buildbot/nix-build gitea:clan/clan-core#checks.aarch64-darwin.all-packages failed
gitea-mq/buildbot/nix-build gitea:clan/clan-core#checks.aarch64-linux.data-mesher error: build of '/nix/store/vix2rxv6qbhxbzhdcraiaik9j9fk50bj-merged-test-dir-data-mesher.drv^out' failed: error: gave up after 9 reschedules
gitea-mq/buildbot/nix-build gitea:clan/clan-core#checks.aarch64-linux.service-dummy-test-from-flake error: build of '/nix/store/1dannijgk3pn19dzpad13p17lhqca1nl-merged-test-dir-service-dummy-test-from-flake.drv^out' failed: error: gave up after 9 reschedules
gitea-mq/buildbot/nix-build gitea:clan/clan-core#checks.aarch64-linux.state-version error: build of '/nix/store/qjlaaplnjd8nacvm4ncscjyl2ixpdnhp-merged-test-dir-service-state-version.drv^out' failed: error: gave up after 9 reschedules
gitea-mq/buildbot/nix-build gitea:clan/clan-core#checks.aarch64-linux.devShell-docs failed
gitea-mq/buildbot/nix-build gitea:clan/clan-core#checks.aarch64-linux.wifi error: build of '/nix/store/5afm43bgg3cqc6a3640y3kz1vkd43swn-merged-test-dir-wifi.drv^out' failed: error: gave up after 9 reschedules
gitea-mq/buildbot/nix-build gitea:clan/clan-core#checks.aarch64-linux.service-dummy-test error: build of '/nix/store/z9naskk0hp6d2q9xbqc6m55zqa3y7vhr-merged-test-dir-service-dummy-test.drv^out' failed: error: gave up after 9 reschedules
gitea-mq/buildbot/nix-build gitea:clan/clan-core#checks.aarch64-linux.zerotier-multi-instance error: build of '/nix/store/zi7hx8rgbdz0gqjrz64hsyv4l8lk9vgb-merged-test-dir-zerotier-multi-instance.drv^out' failed: error: gave up after 9 reschedules
gitea-mq/buildbot/nix-build gitea:clan/clan-core#checks.aarch64-linux.users error: build of '/nix/store/74mgk3pp0ff54g80wqfdmxfp0cl282k4-merged-test-dir-users.drv^out' failed: error: gave up after 9 reschedules
gitea-mq/buildbot/nix-build gitea:clan/clan-core#checks.aarch64-linux.nixos-test-password-store-mounts error: build of '/nix/store/fd4w6z1djq3452qfd2yvp55jcbvcfrmg-merged-test-dir-nixos-test-password-store-mounts.drv^out' failed: error: error: gRPC AddMultipleToStore on 'nix-store.geninf.io:50051' fail
gitea-mq/buildbot/nix-build gitea:clan/clan-core#checks.aarch64-linux.zerotier error: build of '/nix/store/2y0qla7jnff6jkkbmqzj924kfcyr5d9h-merged-test-dir-zerotier.drv^out' failed: error: error: gRPC AddMultipleToStore on 'nix-store.geninf.io:50051' failed: error: path '/nix/st
gitea-mq/buildbot/nix-build gitea:clan/clan-core#checks.aarch64-linux.packages error: build of '/nix/store/nyz3rmrrm4qcxdwbln0414mkr6ldfpqa-merged-test-dir-packages.drv^out' failed: error: error: gRPC AddMultipleToStore on 'nix-store.geninf.io:50051' failed: error: path '/nix/st
gitea-mq/buildbot/nix-build gitea:clan/clan-core#checks.aarch64-linux.wireguard error: build of '/nix/store/5wfp9wvkv2k4xjhxygwlp45dvxzpc8kg-merged-test-dir-wireguard.drv^out' failed: error: error: gRPC AddMultipleToStore on 'nix-store.geninf.io:50051' failed: error: path '/nix/s
gitea-mq/buildbot/nix-build gitea:clan/clan-core#checks.x86_64-linux.borgbackup error: build of '/nix/store/wzr2hscl9xqf93vz7gi108dqrhax5ynw-merged-test-dir-borgbackup.drv^out' failed: error: gave up after 9 reschedules
gitea-mq/buildbot/nix-build gitea:clan/clan-core#checks.aarch64-linux.dyndns error: build of '/nix/store/q1h8mm06ana3jj6ljhmhy9apaa9h0kli-merged-test-dir-dyndns.drv^out' failed: error: error: gRPC AddMultipleToStore on 'nix-store.geninf.io:50051' failed: error: path '/nix/stor
gitea-mq/buildbot/nix-build gitea:clan/clan-core#checks.aarch64-linux.sshd error: build of '/nix/store/zs4n7j21fmqm1ylli4k5bzv0blvwa0b1-merged-test-dir-sshd.drv^out' failed: error: error: gRPC AddMultipleToStore on 'nix-store.geninf.io:50051' failed: error: path '/nix/store/
gitea-mq/buildbot/nix-build gitea:clan/clan-core#checks.aarch64-linux.sshd-no-ca error: build of '/nix/store/avs3c65z02f9gg37cj2lf2qy48pvvlmc-merged-test-dir-sshd.drv^out' failed: error: error: gRPC AddMultipleToStore on 'nix-store.geninf.io:50051' failed: error: path '/nix/store/
gitea-mq/buildbot/nix-build gitea:clan/clan-core#checks.aarch64-linux.p2p-ssh-iroh error: build of '/nix/store/g1ydbrlzfvbi1y56lscz5z0n0s495y26-merged-test-dir-clan-test-p2p-ssh-iroh.drv^out' failed: error: error: gRPC AddMultipleToStore on 'nix-store.geninf.io:50051' failed: error:
gitea-mq/buildbot/nix-build gitea:clan/clan-core#checks.aarch64-linux.matrix-synapse error: build of '/nix/store/86asji4bmwf0nk34wr94a16h090d08mi-merged-test-dir-matrix-synapse.drv^out' failed: error: error: gRPC AddMultipleToStore on 'nix-store.geninf.io:50051' failed: error: path '/
gitea-mq/buildbot/nix-build gitea:clan/clan-core#checks.aarch64-linux.ncps error: build of '/nix/store/xcqvs306r9b9384ybng2iznhxssi40q1-merged-test-dir-ncps.drv^out' failed: error: error: gRPC AddMultipleToStore on 'nix-store.geninf.io:50051' failed: error: path '/nix/store/
gitea-mq/buildbot/nix-build gitea:clan/clan-core#checks.x86_64-linux.matrix-synapse error: build of '/nix/store/sdl93209s82p5xhn4v9294pv3hf185c5-merged-test-dir-matrix-synapse.drv^out' failed: error: gave up after 9 reschedules
gitea-mq/buildbot/nix-build gitea:clan/clan-core#checks.aarch64-linux.yggdrasil error: build of '/nix/store/ys05v6p3b2h4kv99fjkmryckr8x6zq4d-merged-test-dir-yggdrasil.drv^out' failed: error: error: gRPC AddMultipleToStore on 'nix-store.geninf.io:50051' failed: error: path '/nix/s
gitea-mq/buildbot/nix-build gitea:clan/clan-core#checks.x86_64-linux.dyndns error: build of '/nix/store/hijqbkrw6bdhd7i3nl64xzd4ldkxna0g-merged-test-dir-dyndns.drv^out' failed: error: gave up after 9 reschedules
gitea-mq/buildbot/nix-build 58 of 150 attributes failed
gitea-mq Check failed: buildbot/nix-build
docs: services: installer: update command for building iso image
PR Size Review Check / pr-size-review-gate (pull_request) Successful in 18s
sizelint on each commit / sizelint (pull_request) Successful in 28s
buildbot/nix-eval evaluation succeeded in 3m 13s (50 warnings)
buildbot/nix-build gitea:clan/clan-core#checks.aarch64-darwin.treefmt failed
buildbot/nix-build gitea:clan/clan-core#checks.aarch64-linux.clan-pytest-with-core failed
buildbot/nix-build gitea:clan/clan-core#checks.aarch64-linux.borgbackup error: build of '/nix/store/yzllyxpx7yx5charhhknhx1h80dgzrks-merged-test-dir-borgbackup.drv^out' failed: error: error: gRPC AddMultipleToStore on 'nix-store.geninf.io:50051' failed: error: path '/nix/
buildbot/nix-build gitea:clan/clan-core#checks.aarch64-linux.clan-test-iso failed
buildbot/nix-build gitea:clan/clan-core#checks.aarch64-linux.admin error: build of '/nix/store/nzljmbmyjqam1ricrqlv38l0a7w6vr4z-merged-test-dir-admin.drv^out' failed: error: error: gRPC AddMultipleToStore on 'nix-store.geninf.io:50051' failed: error: path '/nix/store
buildbot/nix-build gitea:clan/clan-core#checks.aarch64-linux.devShell-docs failed
buildbot/nix-build gitea:clan/clan-core#checks.aarch64-linux.all-packages failed
buildbot/nix-build gitea:clan/clan-core#checks.aarch64-linux.clan-site-lint failed
buildbot/nix-build gitea:clan/clan-core#checks.aarch64-linux.devShell-clan-site failed
buildbot/nix-build gitea:clan/clan-core#checks.aarch64-darwin.eval-tests failed
buildbot/nix-build gitea:clan/clan-core#checks.aarch64-darwin.clan-pytest-with-core failed
buildbot/nix-build gitea:clan/clan-core#checks.aarch64-darwin.devShell-clan-site failed
buildbot/nix-build gitea:clan/clan-core#checks.aarch64-darwin.all-packages failed
buildbot/nix-build gitea:clan/clan-core#checks.aarch64-linux.certificates error: build of '/nix/store/4cjqx89wv5gl1n537rqbfylvxh7brw05-merged-test-dir-certificates.drv^out' failed: error: error: gRPC AddMultipleToStore on 'nix-store.geninf.io:50051' failed: error: path '/ni
buildbot/nix-build gitea:clan/clan-core#checks.aarch64-linux.data-mesher error: build of '/nix/store/vix2rxv6qbhxbzhdcraiaik9j9fk50bj-merged-test-dir-data-mesher.drv^out' failed: error: error: gRPC AddMultipleToStore on 'nix-store.geninf.io:50051' failed: error: path '/nix
buildbot/nix-build gitea:clan/clan-core#checks.aarch64-linux.dyndns error: build of '/nix/store/q1h8mm06ana3jj6ljhmhy9apaa9h0kli-merged-test-dir-dyndns.drv^out' failed: error: error: gRPC AddMultipleToStore on 'nix-store.geninf.io:50051' failed: error: path '/nix/stor
buildbot/nix-build gitea:clan/clan-core#checks.aarch64-linux.dm-dns error: build of '/nix/store/d5almx1kbj048lc954ydsais4g48mjcj-merged-test-dir-dm-dns.drv^out' failed: error: error: gRPC AddMultipleToStore on 'nix-store.geninf.io:50051' failed: error: path '/nix/stor
buildbot/nix-build gitea:clan/clan-core#checks.aarch64-linux.matrix-synapse error: build of '/nix/store/86asji4bmwf0nk34wr94a16h090d08mi-merged-test-dir-matrix-synapse.drv^out' failed: error: error: gRPC AddMultipleToStore on 'nix-store.geninf.io:50051' failed: error: path '/
buildbot/nix-build gitea:clan/clan-core#checks.aarch64-linux.nixos-test-password-store-mounts error: build of '/nix/store/fd4w6z1djq3452qfd2yvp55jcbvcfrmg-merged-test-dir-nixos-test-password-store-mounts.drv^out' failed: error: error: gRPC AddMultipleToStore on 'nix-store.geninf.io:50051' fail
buildbot/nix-build gitea:clan/clan-core#checks.aarch64-linux.packages error: build of '/nix/store/nyz3rmrrm4qcxdwbln0414mkr6ldfpqa-merged-test-dir-packages.drv^out' failed: error: error: gRPC AddMultipleToStore on 'nix-store.geninf.io:50051' failed: error: path '/nix/st
buildbot/nix-build gitea:clan/clan-core#checks.aarch64-linux.p2p-ssh-iroh error: build of '/nix/store/g1ydbrlzfvbi1y56lscz5z0n0s495y26-merged-test-dir-clan-test-p2p-ssh-iroh.drv^out' failed: error: error: gRPC AddMultipleToStore on 'nix-store.geninf.io:50051' failed: error:
buildbot/nix-build gitea:clan/clan-core#checks.aarch64-linux.sshd error: build of '/nix/store/zs4n7j21fmqm1ylli4k5bzv0blvwa0b1-merged-test-dir-sshd.drv^out' failed: error: error: gRPC AddMultipleToStore on 'nix-store.geninf.io:50051' failed: error: path '/nix/store/
buildbot/nix-build gitea:clan/clan-core#checks.aarch64-linux.sshd-no-ca error: build of '/nix/store/avs3c65z02f9gg37cj2lf2qy48pvvlmc-merged-test-dir-sshd.drv^out' failed: error: error: gRPC AddMultipleToStore on 'nix-store.geninf.io:50051' failed: error: path '/nix/store/
buildbot/nix-build gitea:clan/clan-core#checks.aarch64-linux.trusted-nix-caches error: build of '/nix/store/dpb92ps6qqwgi1mfb9sp3p8d0ckj9nn3-merged-test-dir-trusted-nix-caches.drv^out' failed: error: error: gRPC AddMultipleToStore on 'nix-store.geninf.io:50051' failed: error: pat
buildbot/nix-build gitea:clan/clan-core#checks.aarch64-linux.kde error: build of '/nix/store/7ss8jk5j8lvlkvz9z21kmdvs01hrphhs-merged-test-dir-kde.drv^out' failed: error: gave up after 9 reschedules
buildbot/nix-build gitea:clan/clan-core#checks.aarch64-linux.localbackup error: build of '/nix/store/5m2vgn4i1s4amwk8pnrgs25mzmiqbvr0-merged-test-dir-localbackup.drv^out' failed: error: gave up after 9 reschedules
buildbot/nix-build gitea:clan/clan-core#checks.aarch64-linux.monitoring error: build of '/nix/store/zxbvacfhq72cfbwqbkvps2lqr6z2nfcm-merged-test-dir-monitoring.drv^out' failed: error: gave up after 9 reschedules
buildbot/nix-build gitea:clan/clan-core#checks.aarch64-linux.hello-service error: build of '/nix/store/w57zn5d5mvjpj5m3vx6ha3l25anzmm6j-merged-test-dir-hello-service.drv^out' failed: error: gave up after 9 reschedules
buildbot/nix-build gitea:clan/clan-core#checks.aarch64-linux.wireguard error: build of '/nix/store/5wfp9wvkv2k4xjhxygwlp45dvxzpc8kg-merged-test-dir-wireguard.drv^out' failed: error: error: gRPC AddMultipleToStore on 'nix-store.geninf.io:50051' failed: error: path '/nix/s
buildbot/nix-build gitea:clan/clan-core#checks.aarch64-linux.yggdrasil error: build of '/nix/store/ys05v6p3b2h4kv99fjkmryckr8x6zq4d-merged-test-dir-yggdrasil.drv^out' failed: error: error: gRPC AddMultipleToStore on 'nix-store.geninf.io:50051' failed: error: path '/nix/s
buildbot/nix-build gitea:clan/clan-core#checks.x86_64-linux.admin error: build of '/nix/store/zl84skhp27xnl77b62lzjihlbq07vryd-merged-test-dir-admin.drv^out' failed: error: error: gRPC AddMultipleToStore on 'nix-store.geninf.io:50051' failed: error: path '/nix/store
buildbot/nix-build gitea:clan/clan-core#checks.x86_64-linux.borgbackup error: build of '/nix/store/zivl2hinxs22isnb9dsqbllzg1228q3c-merged-test-dir-borgbackup.drv^out' failed: error: error: gRPC AddMultipleToStore on 'nix-store.geninf.io:50051' failed: error: path '/nix/
buildbot/nix-build gitea:clan/clan-core#checks.aarch64-linux.garage error: build of '/nix/store/pxwv2ysglq7205k0pn3rzmv4k07k9nz9-merged-test-dir-garage.drv^out' failed: error: gave up after 9 reschedules
buildbot/nix-build gitea:clan/clan-core#checks.aarch64-linux.machine-id error: build of '/nix/store/xh8bqz8463ag3rml28aln1fwahy9phhj-merged-test-dir-service-machine-id.drv^out' failed: error: gave up after 9 reschedules
buildbot/nix-build gitea:clan/clan-core#checks.aarch64-linux.mycelium error: build of '/nix/store/xqzx5sw4sqqflh84m47lx6fcajavz3s3-merged-test-dir-mycelium.drv^out' failed: error: gave up after 9 reschedules
buildbot/nix-build gitea:clan/clan-core#checks.aarch64-linux.postgresql error: build of '/nix/store/5iibba5p38fym6ym62k83fx13cnqvabv-merged-test-dir-service-postgresql.drv^out' failed: error: gave up after 9 reschedules
buildbot/nix-build gitea:clan/clan-core#checks.aarch64-linux.pki error: build of '/nix/store/w8kr1wjhbsz621nwm6cchg61w4hpfsa2-merged-test-dir-pki.drv^out' failed: error: gave up after 9 reschedules
buildbot/nix-build gitea:clan/clan-core#checks.aarch64-linux.ncps error: build of '/nix/store/xcqvs306r9b9384ybng2iznhxssi40q1-merged-test-dir-ncps.drv^out' failed: error: gave up after 9 reschedules
buildbot/nix-build gitea:clan/clan-core#checks.aarch64-linux.service-dummy-test error: build of '/nix/store/z9naskk0hp6d2q9xbqc6m55zqa3y7vhr-merged-test-dir-service-dummy-test.drv^out' failed: error: gave up after 9 reschedules
buildbot/nix-build gitea:clan/clan-core#checks.aarch64-linux.service-dummy-test-from-flake error: build of '/nix/store/1dannijgk3pn19dzpad13p17lhqca1nl-merged-test-dir-service-dummy-test-from-flake.drv^out' failed: error: gave up after 9 reschedules
buildbot/nix-build gitea:clan/clan-core#checks.aarch64-linux.state-version error: build of '/nix/store/qjlaaplnjd8nacvm4ncscjyl2ixpdnhp-merged-test-dir-service-state-version.drv^out' failed: error: gave up after 9 reschedules
buildbot/nix-build gitea:clan/clan-core#checks.aarch64-linux.syncthing-service error: build of '/nix/store/7pq323b8ncdqa64xkh24ryldvpyqzmxx-merged-test-dir-syncthing-service.drv^out' failed: error: gave up after 9 reschedules
buildbot/nix-build gitea:clan/clan-core#checks.aarch64-linux.users error: build of '/nix/store/74mgk3pp0ff54g80wqfdmxfp0cl282k4-merged-test-dir-users.drv^out' failed: error: gave up after 9 reschedules
buildbot/nix-build gitea:clan/clan-core#checks.aarch64-linux.wifi error: build of '/nix/store/5afm43bgg3cqc6a3640y3kz1vkd43swn-merged-test-dir-wifi.drv^out' failed: error: gave up after 9 reschedules
buildbot/nix-build gitea:clan/clan-core#checks.x86_64-linux.dyndns error: build of '/nix/store/hijqbkrw6bdhd7i3nl64xzd4ldkxna0g-merged-test-dir-dyndns.drv^out' failed: error: error: gRPC AddMultipleToStore on 'nix-store.geninf.io:50051' failed: error: path '/nix/stor
buildbot/nix-build gitea:clan/clan-core#checks.x86_64-linux.matrix-synapse error: build of '/nix/store/sdl93209s82p5xhn4v9294pv3hf185c5-merged-test-dir-matrix-synapse.drv^out' failed: error: error: gRPC AddMultipleToStore on 'nix-store.geninf.io:50051' failed: error: path '/
buildbot/nix-build gitea:clan/clan-core#checks.aarch64-linux.zerotier-multi-instance error: build of '/nix/store/zi7hx8rgbdz0gqjrz64hsyv4l8lk9vgb-merged-test-dir-zerotier-multi-instance.drv^out' failed: error: gave up after 9 reschedules
buildbot/nix-build 56 of 150 attributes failed
Type
Community Contribution
1
fix: clanLib: pass through user-defined specialArgs
PR Size Review Check / pr-size-review-gate (pull_request) Successful in 5s
sizelint on each commit / sizelint (pull_request) Successful in 9s
buildbot/nix-eval evaluation succeeded in 3m 6s (1 warning)
buildbot/nix-build gitea:clan/clan-core#checks.aarch64-linux.eval-tests failed
buildbot/nix-build gitea:clan/clan-core#checks.x86_64-linux.eval-tests failed
buildbot/nix-build gitea:clan/clan-core#checks.aarch64-darwin.eval-tests failed
buildbot/nix-build 3 of 150 attributes failed
inventory/nixpkgs: init nixpkgs sets
PR Size Review Check / pr-size-review-gate (pull_request) Failing after 15s
sizelint on each commit / sizelint (pull_request) Successful in 18s
buildbot/nix-eval evaluation succeeded in 1m 25s (5 warnings)
buildbot/nix-build gitea:clan/clan-core#checks.x86_64-linux.treefmt failed
buildbot/nix-build gitea:clan/clan-core#checks.x86_64-linux.clan-pytest-without-core failed
buildbot/nix-build gitea:clan/clan-core#checks.aarch64-linux.eval-tests failed
buildbot/nix-build gitea:clan/clan-core#checks.aarch64-darwin.treefmt failed
buildbot/nix-build gitea:clan/clan-core#checks.aarch64-darwin.all-packages failed
buildbot/nix-build gitea:clan/clan-core#checks.aarch64-linux.treefmt failed
buildbot/nix-build gitea:clan/clan-core#checks.aarch64-linux.clan-pytest-without-core failed
buildbot/nix-build gitea:clan/clan-core#checks.aarch64-darwin.clan-pytest-without-core failed
buildbot/nix-build gitea:clan/clan-core#checks.aarch64-linux.darwin-test-darwin-machine failed
buildbot/nix-build gitea:clan/clan-core#checks.x86_64-linux.darwin-test-darwin-machine failed
buildbot/nix-build gitea:clan/clan-core#checks.aarch64-darwin.clan-pytest-with-core failed
buildbot/nix-build gitea:clan/clan-core#checks.x86_64-linux.eval-tests failed
buildbot/nix-build gitea:clan/clan-core#checks.aarch64-darwin.darwin-test-darwin-machine failed
buildbot/nix-build gitea:clan/clan-core#checks.aarch64-darwin.devShell-inventory-schema failed
buildbot/nix-build gitea:clan/clan-core#checks.aarch64-darwin.inventory-classes-up-to-date failed
buildbot/nix-build gitea:clan/clan-core#checks.aarch64-darwin.lib-jsonschema-example-valid failed
buildbot/nix-build gitea:clan/clan-core#checks.aarch64-darwin.clan-deps failed
buildbot/nix-build gitea:clan/clan-core#checks.aarch64-darwin.devShell-clan-site failed
buildbot/nix-build gitea:clan/clan-core#checks.aarch64-darwin.devShell-default failed
buildbot/nix-build gitea:clan/clan-core#checks.aarch64-darwin.devshell dependency_failed
buildbot/nix-build gitea:clan/clan-core#checks.x86_64-linux.clan-pytest-with-core failed
buildbot/nix-build gitea:clan/clan-core#checks.aarch64-darwin.eval-tests failed
buildbot/nix-build gitea:clan/clan-core#checks.x86_64-linux.all-packages failed
buildbot/nix-build gitea:clan/clan-core#checks.aarch64-darwin.devShell-clan-cli failed
buildbot/nix-build gitea:clan/clan-core#checks.aarch64-linux.all-packages failed
buildbot/nix-build gitea:clan/clan-core#checks.aarch64-linux.borgbackup error: Flake does not have 'input' named 'nixpkgs'
buildbot/nix-build gitea:clan/clan-core#checks.aarch64-linux.clan-pytest-with-core failed
buildbot/nix-build gitea:clan/clan-core#checks.aarch64-linux.nixos-documentation error: Flake does not have 'input' named 'nixpkgs'
buildbot/nix-build gitea:clan/clan-core#checks.x86_64-linux.nixos-test-update-hardware-configuration error: Flake does not have 'input' named 'nixpkgs'
buildbot/nix-build gitea:clan/clan-core#checks.aarch64-linux.admin error: Flake does not have 'input' named 'nixpkgs'
buildbot/nix-build gitea:clan/clan-core#checks.aarch64-linux.certificates error: Flake does not have 'input' named 'nixpkgs'
buildbot/nix-build gitea:clan/clan-core#checks.aarch64-linux.data-mesher error: Flake does not have 'input' named 'nixpkgs'
buildbot/nix-build gitea:clan/clan-core#checks.aarch64-linux.dm-dns error: Flake does not have 'input' named 'nixpkgs'
buildbot/nix-build gitea:clan/clan-core#checks.aarch64-linux.kde error: Flake does not have 'input' named 'nixpkgs'
buildbot/nix-build gitea:clan/clan-core#checks.aarch64-linux.dyndns error: Flake does not have 'input' named 'nixpkgs'
buildbot/nix-build gitea:clan/clan-core#checks.aarch64-linux.localbackup error: Flake does not have 'input' named 'nixpkgs'
buildbot/nix-build gitea:clan/clan-core#checks.aarch64-linux.hello-service error: Flake does not have 'input' named 'nixpkgs'
buildbot/nix-build gitea:clan/clan-core#checks.aarch64-linux.garage error: Flake does not have 'input' named 'nixpkgs'
buildbot/nix-build gitea:clan/clan-core#checks.aarch64-linux.matrix-synapse error: Flake does not have 'input' named 'nixpkgs'
buildbot/nix-build gitea:clan/clan-core#checks.aarch64-linux.machine-id error: Flake does not have 'input' named 'nixpkgs'
buildbot/nix-build gitea:clan/clan-core#checks.aarch64-linux.monitoring error: Flake does not have 'input' named 'nixpkgs'
buildbot/nix-build gitea:clan/clan-core#checks.aarch64-linux.mycelium error: Flake does not have 'input' named 'nixpkgs'
buildbot/nix-build gitea:clan/clan-core#checks.aarch64-linux.ncps error: Flake does not have 'input' named 'nixpkgs'
buildbot/nix-build gitea:clan/clan-core#checks.aarch64-linux.nixos-test-password-store-mounts error: Flake does not have 'input' named 'nixpkgs'
buildbot/nix-build gitea:clan/clan-core#checks.aarch64-linux.p2p-ssh-iroh error: Flake does not have 'input' named 'nixpkgs'
buildbot/nix-build gitea:clan/clan-core#checks.aarch64-linux.pki error: Flake does not have 'input' named 'nixpkgs'
buildbot/nix-build gitea:clan/clan-core#checks.aarch64-linux.packages error: Flake does not have 'input' named 'nixpkgs'
buildbot/nix-build gitea:clan/clan-core#checks.aarch64-linux.postgresql error: Flake does not have 'input' named 'nixpkgs'
buildbot/nix-build gitea:clan/clan-core#checks.aarch64-linux.service-dummy-test-from-flake error: Flake does not have 'input' named 'nixpkgs'
buildbot/nix-build gitea:clan/clan-core#checks.aarch64-linux.sshd error: Flake does not have 'input' named 'nixpkgs'
buildbot/nix-build gitea:clan/clan-core#checks.aarch64-linux.state-version error: Flake does not have 'input' named 'nixpkgs'
buildbot/nix-build gitea:clan/clan-core#checks.aarch64-linux.syncthing-service error: Flake does not have 'input' named 'nixpkgs'
buildbot/nix-build gitea:clan/clan-core#checks.aarch64-linux.trusted-nix-caches error: Flake does not have 'input' named 'nixpkgs'
buildbot/nix-build gitea:clan/clan-core#checks.aarch64-linux.users error: Flake does not have 'input' named 'nixpkgs'
buildbot/nix-build gitea:clan/clan-core#checks.aarch64-linux.wifi error: Flake does not have 'input' named 'nixpkgs'
buildbot/nix-build gitea:clan/clan-core#checks.aarch64-linux.wireguard error: Flake does not have 'input' named 'nixpkgs'
buildbot/nix-build gitea:clan/clan-core#checks.aarch64-linux.yggdrasil error: Flake does not have 'input' named 'nixpkgs'
buildbot/nix-build gitea:clan/clan-core#checks.aarch64-linux.zerotier error: Flake does not have 'input' named 'nixpkgs'
buildbot/nix-build gitea:clan/clan-core#checks.aarch64-linux.service-dummy-test error: Flake does not have 'input' named 'nixpkgs'
buildbot/nix-build gitea:clan/clan-core#checks.aarch64-linux.zerotier-multi-instance error: Flake does not have 'input' named 'nixpkgs'
buildbot/nix-build gitea:clan/clan-core#checks.x86_64-linux.admin error: Flake does not have 'input' named 'nixpkgs'
buildbot/nix-build gitea:clan/clan-core#checks.x86_64-linux.borgbackup error: Flake does not have 'input' named 'nixpkgs'
buildbot/nix-build gitea:clan/clan-core#checks.aarch64-linux.sshd-no-ca error: Flake does not have 'input' named 'nixpkgs'
buildbot/nix-build gitea:clan/clan-core#checks.x86_64-linux.certificates error: Flake does not have 'input' named 'nixpkgs'
buildbot/nix-build gitea:clan/clan-core#checks.x86_64-linux.data-mesher error: Flake does not have 'input' named 'nixpkgs'
buildbot/nix-build gitea:clan/clan-core#checks.x86_64-linux.clan-test-update error: Flake does not have 'input' named 'nixpkgs'
buildbot/nix-build gitea:clan/clan-core#checks.x86_64-linux.dm-dns error: Flake does not have 'input' named 'nixpkgs'
buildbot/nix-build gitea:clan/clan-core#checks.x86_64-linux.dyndns error: Flake does not have 'input' named 'nixpkgs'
buildbot/nix-build gitea:clan/clan-core#checks.x86_64-linux.garage error: Flake does not have 'input' named 'nixpkgs'
buildbot/nix-build gitea:clan/clan-core#checks.x86_64-linux.hello-service error: Flake does not have 'input' named 'nixpkgs'
buildbot/nix-build gitea:clan/clan-core#checks.x86_64-linux.kde error: Flake does not have 'input' named 'nixpkgs'
buildbot/nix-build gitea:clan/clan-core#checks.x86_64-linux.localbackup error: Flake does not have 'input' named 'nixpkgs'
buildbot/nix-build gitea:clan/clan-core#checks.x86_64-linux.matrix-synapse error: Flake does not have 'input' named 'nixpkgs'
buildbot/nix-build gitea:clan/clan-core#checks.x86_64-linux.machine-id error: Flake does not have 'input' named 'nixpkgs'
buildbot/nix-build gitea:clan/clan-core#checks.x86_64-linux.monitoring error: Flake does not have 'input' named 'nixpkgs'
buildbot/nix-build gitea:clan/clan-core#checks.x86_64-linux.nixos-documentation error: Flake does not have 'input' named 'nixpkgs'
buildbot/nix-build gitea:clan/clan-core#checks.x86_64-linux.mycelium error: Flake does not have 'input' named 'nixpkgs'
buildbot/nix-build gitea:clan/clan-core#checks.x86_64-linux.ncps error: Flake does not have 'input' named 'nixpkgs'
buildbot/nix-build gitea:clan/clan-core#checks.x86_64-linux.nixos-test-installation error: Flake does not have 'input' named 'nixpkgs'
buildbot/nix-build gitea:clan/clan-core#checks.x86_64-linux.nixos-test-installation-age error: Flake does not have 'input' named 'nixpkgs'
buildbot/nix-build gitea:clan/clan-core#checks.x86_64-linux.nixos-test-password-store-mounts error: Flake does not have 'input' named 'nixpkgs'
buildbot/nix-build gitea:clan/clan-core#checks.x86_64-linux.nixos-test-installation-password-store error: Flake does not have 'input' named 'nixpkgs'
buildbot/nix-build gitea:clan/clan-core#checks.x86_64-linux.packages error: Flake does not have 'input' named 'nixpkgs'
buildbot/nix-build gitea:clan/clan-core#checks.x86_64-linux.p2p-ssh-iroh error: Flake does not have 'input' named 'nixpkgs'
buildbot/nix-build gitea:clan/clan-core#checks.x86_64-linux.pki error: Flake does not have 'input' named 'nixpkgs'
buildbot/nix-build gitea:clan/clan-core#checks.x86_64-linux.postgresql error: Flake does not have 'input' named 'nixpkgs'
buildbot/nix-build gitea:clan/clan-core#checks.x86_64-linux.nixos-test-flash error: Flake does not have 'input' named 'nixpkgs'
buildbot/nix-build gitea:clan/clan-core#checks.x86_64-linux.service-dummy-test error: Flake does not have 'input' named 'nixpkgs'
buildbot/nix-build gitea:clan/clan-core#checks.x86_64-linux.service-dummy-test-from-flake error: Flake does not have 'input' named 'nixpkgs'
buildbot/nix-build gitea:clan/clan-core#checks.x86_64-linux.sshd error: Flake does not have 'input' named 'nixpkgs'
buildbot/nix-build gitea:clan/clan-core#checks.x86_64-linux.sshd-no-ca error: Flake does not have 'input' named 'nixpkgs'
buildbot/nix-build gitea:clan/clan-core#checks.x86_64-linux.state-version error: Flake does not have 'input' named 'nixpkgs'
buildbot/nix-build gitea:clan/clan-core#checks.x86_64-linux.syncthing-service error: Flake does not have 'input' named 'nixpkgs'
buildbot/nix-build gitea:clan/clan-core#checks.x86_64-linux.trusted-nix-caches error: Flake does not have 'input' named 'nixpkgs'
buildbot/nix-build 101 of 150 attributes failed